{"text_format":"1","workbook":"xlsx","n_sheets":7,"sheets":["Instructions","Report Calculator (Required)","Report Calculator (Voluntary)","Summary","Lists","Calcs","Zips"],"not_rendered":{"charts":0,"images":6,"macros":1,"external_links":0,"defined_names":1,"comments":0,"pivot_tables":0},"unopened":[],"bounds":{"document_bytes":16777216,"sheet_cells":100000,"rows_first":2000,"rows_last":500,"rows_between":2000,"halvings":0,"cell_chars":16384,"cell_head_chars":4096},"cells_cut":0,"cells_raw":0,"read":"whole","date_system":"1900"}

{"sheet":"Instructions","index":0,"n_rows":54,"n_cols":3,"rows_kept":54,"cut":false,"hidden":false,"merged":[[0,0,0,2]]}
["Please note the following instructions for the best way to complete each part of the tool."]
["Question","Required or Optional","Instructions"]
["What year is this report being filed for?","Required","Please enter the year this report will cover (i.e., 2020)."]
["Under Filer Details:"]
["What is your relationship to the business(es) for whom this Annual Report is being filed? ","Required; only if you want to know your reports filing due date. ","Select the appropriate answer that corresponds to this report from the drop-down list. "]
["Business Name","Optional ","Fill out the business or property title that the report will reflect. "]
["Mailing Address and Zip Code","Required; only if you want to know your Program Specialist's contact information.","Fill out only one address for the report. If the report reflects multiple businesses or a multi-tenant building, only fill in the primary reporting address. If the zip codes differ, consider using the tool for each individual business, as the zip code will supply the name and contact information for your specific Program Specialist. If you do not need this information, consider leaving this part blank. "]
["Phone Number","Optional ","Fill out the main contact number if you would like this for your records. "]
["Contact Person and Title","Optional ","Fill out your name and title."]
["Contact Person Email ","Optional ","Fill out your email address. "]
["If Government Agency, select which: ","Required; only if you are a government agency and want to know your Program Specialist's contact information.","Select the appropriate answer that corresponds to you from the drop-down list. If you are not a government agency, consider leaving this blank or selecting \"none of the above.\""]
["Total number of employees covered by this report:","Optional ","Fill out the number of active employees for all businesses covered in this report. If it is a multi-tenant facility, please complete this to the best of your knowledge for your own records. "]
["Total square feet of building space covered by this report: ","Optional ","Fill out the total area of the one or multiple businesses covered by the report. "]
["Total acreage of green area (landscaped and grassy area) covered by this report: ","Required; only if you want to calculate your yard trim weights. ","Fill out the total acreage of landscaped area only. If you have no green area, consider leaving this blank. "]
["Under COVID-19 Information: "]
{"$rows_left_out":40}
{"sheet":"Report Calculator (Required)","index":1,"n_rows":497,"n_cols":11,"rows_kept":497,"cut":false,"hidden":false,"merged":[[452,1,452,2],[454,1,454,2],[456,1,456,2],[471,1,471,2],[473,1,473,2],[475,1,475,2],[399,1,399,2],[91,1,91,2],[106,1,106,2],[108,1,108,2],[110,1,110,2],[296,1,296,2],[298,1,298,2],[300,1,300,2],[277,1,277,2],[279,1,279,2],[281,1,281,2],[258,1,258,2],[260,1,260,2],[262,1,262,2],[239,1,239,2],[241,1,241,2],[243,1,243,2],[220,1,220,2],[222,1,222,2],[224,1,224,2],[210,1,210,2],[229,1,229,2],[248,1,248,2],[267,1,267,2],[286,1,286,2],[22,1,22,2],[49,1,49,2],[51,1,51,2],[53,1,53,2],[68,1,68,2],[70,1,70,2],[72,1,72,2],[87,1,87,2],[89,1,89,2],[214,1,214,2],[216,1,216,2],[218,1,218,2],[227,1,227,2],[228,1,228,2],[231,1,231,2],[235,1,235,2],[237,1,237,2],[478,1,478,2],[479,1,479,2],[461,1,461,2],[463,1,463,2],[465,1,465,2],[467,1,467,2],[469,1,469,2],[459,1,459,2],[460,1,460,2],[492,1,492,2],[494,1,494,2],[498,1,498,2],[500,1,500,2],[490,1,490,2],[480,1,480,2],[482,1,482,2],[484,1,484,2],[486,1,486,2],[488,1,488,2],[446,1,446,2],[448,1,448,2],[450,1,450,2],[440,1,440,2],[441,1,441,2],[406,1,406,2],[408,1,408,2],[410,1,410,2],[412,1,412,2],[421,1,421,2],[422,1,422,2],[431,1,431,2],[423,1,423,2],[425,1,425,2],[427,1,427,2],[429,1,429,2],[442,1,442,2],[444,1,444,2],[414,1,414,2],[416,1,416,2],[418,1,418,2],[433,1,433,2],[435,1,435,2],[437,1,437,2],[395,1,395,2],[385,1,385,2],[387,1,387,2],[389,1,389,2],[391,1,391,2],[393,1,393,2],[376,1,376,2],[379,1,379,2],[380,1,380,2],[381,1,381,2],[383,1,383,2],[366,1,366,2],[368,1,368,2],[370,1,370,2],[372,1,372,2],[374,1,374,2],[364,1,364,2],[347,1,347,2],[349,1,349,2],[351,1,351,2],[353,1,353,2],[355,1,355,2],[338,1,338,2],[341,1,341,2],[342,1,342,2],[343,1,343,2],[345,1,345,2],[357,1,357,2],[360,1,360,2],[361,1,361,2],[362,1,362,2],[328,1,328,2],[330,1,330,2],[332,1,332,2],[334,1,334,2],[336,1,336,2],[307,1,307,2],[323,1,323,2],[324,1,324,2],[326,1,326,2],[246,1,246,2],[247,1,247,2],[250,1,250,2],[252,1,252,2],[254,1,254,2],[256,1,256,2],[309,1,309,2],[322,1,322,2],[311,1,311,2],[305,1,305,2],[294,1,294,2],[284,1,284,2],[285,1,285,2],[288,1,288,2],[290,1,290,2],[292,1,292,2],[275,1,275,2],[265,1,265,2],[266,1,266,2],[269,1,269,2],[271,1,271,2],[273,1,273,2],[203,1,203,2],[205,1,205,2],[24,1,24,2],[26,1,26,2],[28,1,28,2],[30,1,30,2],[56,1,56,2],[57,1,57,2],[58,1,58,2],[64,1,64,2],[66,1,66,2],[193,1,193,2],[195,1,195,2],[197,1,197,2],[199,1,199,2],[201,1,201,2],[184,1,184,2],[186,1,186,2],[190,1,190,2],[191,1,191,2],[174,1,174,2],[176,1,176,2],[178,1,178,2],[180,1,180,2],[167,1,167,2],[170,1,170,2],[171,1,171,2],[172,1,172,2],[16,1,16,2],[0,1,0,2],[3,1,3,2],[2,1,2,2],[4,1,4,2],[5,1,5,2],[7,1,7,2],[8,1,8,2],[9,1,9,2],[10,1,10,2],[11,1,11,2],[12,1,12,2],[13,1,13,2],[14,1,14,2],[15,1,15,2],[1,0,1,2],[17,1,17,2],[18,1,18,2],[34,1,34,2],[32,1,32,2],[189,1,189,2],[19,1,19,2],[20,1,20,2],[113,1,113,2],[37,1,37,2],[38,1,38,2],[39,1,39,2],[41,1,41,2],[75,1,75,2],[76,1,76,2],[77,1,77,2],[79,1,79,2],[81,1,81,2],[43,1,43,2],[45,1,45,2],[47,1,47,2],[104,1,104,2],[95,1,95,2],[96,1,96,2],[98,1,98,2],[100,1,100,2],[102,1,102,2],[182,1,182,2],[165,1,165,2],[208,1,208,2],[209,1,209,2],[212,1,212,2],[303,1,303,2],[304,1,304,2],[121,1,121,2],[119,1,119,2],[132,1,132,2],[133,1,133,2],[134,1,134,2],[136,1,136,2],[140,1,140,2],[142,1,142,2],[144,1,144,2],[155,1,155,2],[157,1,157,2],[159,1,159,2],[161,1,161,2],[163,1,163,2],[146,1,146,2],[148,1,148,2],[151,1,151,2],[152,1,152,2],[153,1,153,2],[0,3,0,8],[398,1,398,2],[400,1,400,2],[402,1,402,2],[403,1,403,2],[404,1,404,2],[313,1,313,2],[315,1,315,2],[60,1,60,2],[62,1,62,2],[125,1,125,2],[127,1,127,2],[129,1,129,2],[123,1,123,2],[114,1,114,2],[83,1,83,2],[85,1,85,2],[94,1,94,2],[117,1,117,2],[138,1,138,2],[317,1,317,2],[319,1,319,2],[233,1,233,2],[115,1,115,2]]}
[null,null,null,"Please note the following instructions:\n1. Click \"Enable Content\" if prompted by Excel, otherwise this form will not function.\n2. Please fill out all relevant fields to best calculate recycling weights.\n3. Limit entries to one (1) business site per form for best results.\n4. One form can accommodate a maximum of five (5) different container types per waste stream.\n5. Refrain from including \"On-Call\" waste streams--please obtain this data directly from collectors/haulers.\n6. If you have any questions about how to fill out the form, please review the provided instruction sheet. "]
["Annual Recycling Report Completion Tool"]
["What year is this report being filed for?"]
["Filer Details"]
["What is your relationship to the business(es) for whom this Annual Report is being filed? "]
["Business Name"]
["Mailing Address and Zip Code"]
["Phone Number"]
["Contact Person and Title"]
["Contact Person Email "]
["If Government Agency, select which: "]
["Total number of employees covered by this report:"]
["Total square feet of building space covered by this report: "]
["Total acreage of green area (landscaped and grassy area) covered by this report: "]
["COVID-19 Information"]
{"$rows_left_out":483}
{"sheet":"Report Calculator (Voluntary)","index":2,"n_rows":91,"n_cols":4,"rows_kept":91,"cut":false,"hidden":false,"merged":[[32,0,32,2],[0,3,0,8],[1,0,1,2],[0,0,0,1],[3,0,3,2],[7,0,7,2],[20,0,20,2],[27,0,27,2],[24,0,24,2],[4,0,4,2],[15,0,15,2],[19,0,19,2],[81,0,81,2],[33,0,33,2],[36,0,36,2],[38,0,38,2],[54,0,54,2],[46,0,46,2],[70,0,70,2],[74,0,74,2],[77,0,77,2],[61,0,61,2],[63,0,63,2],[66,0,66,2],[69,0,69,2]]}
[null,null,null,"Please note the following instructions:\n1. Click \"Enable Content\" if prompted by Excel, otherwise this form will not function.\n2. All quantities for each voluntary material must be for the entire year.\n3. Please fill out all relevant fields to best calculate recycling weights.\n4. Limit entries to one (1) business site per form for best results.\n5. Refrain from including \"On-Call\" waste streams--please obtain this data directly from collectors/haulers.\n"]
["Annual Recycling Report Completion Tool"]
["Recyclable Material","Unit","Number"]
["Computers & Electronic Equipment",null,true]
["Computers"]
["     Desktop","one"]
["     Laptop","one"]
["Peripheral Devices"]
["     CRT Monitor - 15\"","one"]
["     CRT Monitor - 17\"","one"]
["     CRT Monitor - 21\"","one"]
["     Flat Panel Monitor","one"]
["     Printer","one"]
["     Mouse","one"]
["     Keyboard","one"]
{"$rows_left_out":77}
{"sheet":"Summary","index":3,"n_rows":373,"n_cols":4,"rows_kept":373,"cut":false,"hidden":false,"merged":[[262,2,262,3],[218,2,218,3],[219,2,219,3],[251,2,251,3],[253,2,253,3],[255,2,255,3],[257,2,257,3],[259,2,259,3],[260,2,260,3],[261,2,261,3],[221,2,221,3],[223,2,223,3],[224,2,224,3],[225,2,225,3],[230,2,230,3],[250,2,250,3],[252,2,252,3],[254,2,254,3],[238,2,238,3],[240,2,240,3],[244,2,244,3],[246,2,246,3],[134,2,134,3],[135,2,135,3],[136,2,136,3],[137,2,137,3],[138,2,138,3],[205,2,205,3],[206,2,206,3],[207,2,207,3],[208,2,208,3],[141,2,141,3],[186,2,186,3],[187,2,187,3],[188,2,188,3],[189,2,189,3],[190,2,190,3],[200,2,200,3],[201,2,201,3],[202,2,202,3],[203,2,203,3],[204,2,204,3],[198,2,198,3],[199,2,199,3],[148,2,148,3],[149,2,149,3],[125,2,125,3],[126,2,126,3],[127,2,127,3],[128,2,128,3],[129,2,129,3],[130,2,130,3],[131,2,131,3],[132,2,132,3],[133,2,133,3],[91,2,91,3],[92,2,92,3],[93,2,93,3],[94,2,94,3],[95,2,95,3],[96,2,96,3],[97,2,97,3],[98,2,98,3],[124,2,124,3],[36,2,36,3],[38,2,38,3],[144,2,144,3],[146,2,146,3],[150,2,150,3],[152,2,152,3],[154,2,154,3],[156,2,156,3],[67,2,67,3],[69,2,69,3],[71,2,71,3],[73,2,73,3],[77,2,77,3],[79,2,79,3],[155,2,155,3],[145,2,145,3],[147,2,147,3],[84,2,84,3],[85,2,85,3],[86,2,86,3],[87,2,87,3],[88,2,88,3],[89,2,89,3],[90,2,90,3],[151,2,151,3],[153,2,153,3],[78,2,78,3],[80,2,80,3],[82,2,82,3],[27,2,27,3],[28,2,28,3],[29,2,29,3],[24,2,24,3],[26,2,26,3],[104,2,104,3],[105,2,105,3],[106,2,106,3],[107,2,107,3],[108,2,108,3],[109,2,109,3],[110,2,110,3],[111,2,111,3],[139,2,139,3],[52,2,52,3],[53,2,53,3],[55,2,55,3],[57,2,57,3],[64,2,64,3],[19,2,19,3],[30,2,30,3],[32,2,32,3],[34,2,34,3],[256,2,256,3],[258,2,258,3],[4,0,4,3],[14,2,14,3],[5,0,5,1],[6,0,6,1],[248,2,248,3],[249,2,249,3],[239,2,239,3],[241,2,241,3],[242,2,242,3],[243,2,243,3],[245,2,245,3],[247,2,247,3],[227,2,227,3],[229,2,229,3],[231,2,231,3],[233,2,233,3],[235,2,235,3],[237,2,237,3],[15,0,15,1],[7,0,7,1],[8,0,8,1],[173,2,173,3],[175,2,175,3],[168,2,168,3],[170,2,170,3],[172,2,172,3],[174,2,174,3],[81,2,81,3],[83,2,83,3],[140,2,140,3],[142,2,142,3],[68,2,68,3],[70,2,70,3],[72,2,72,3],[74,2,74,3],[75,2,75,3],[76,2,76,3],[99,2,99,3],[100,2,100,3],[101,2,101,3],[102,2,102,3],[103,2,103,3],[176,2,176,3],[178,2,178,3],[220,2,220,3],[222,2,222,3],[226,2,226,3],[228,2,228,3],[232,2,232,3],[234,2,234,3],[236,2,236,3],[177,2,177,3],[179,2,179,3],[211,2,211,3],[212,2,212,3],[213,2,213,3],[214,2,214,3],[215,2,215,3],[216,2,216,3],[217,2,217,3],[209,2,209,3],[210,2,210,3],[66,2,66,3],[54,2,54,3],[56,2,56,3],[58,2,58,3],[65,2,65,3],[59,2,59,3],[60,2,60,3],[61,2,61,3],[62,2,62,3],[63,2,63,3],[11,0,11,1],[12,0,12,1],[43,2,43,3],[45,2,45,3],[47,2,47,3],[49,2,49,3],[51,2,51,3],[44,2,44,3],[46,2,46,3],[48,2,48,3],[50,2,50,3],[18,2,18,3],[20,2,20,3],[22,2,22,3],[41,2,41,3],[31,2,31,3],[33,2,33,3],[35,2,35,3],[37,2,37,3],[39,2,39,3],[40,2,40,3],[21,2,21,3],[23,2,23,3],[25,2,25,3],[169,2,169,3],[171,2,171,3],[42,2,42,3],[0,2,0,3],[2,2,2,3],[3,2,3,3],[2,0,2,1],[12,2,12,3],[13,2,13,3],[15,2,15,3],[16,2,16,3],[17,2,17,3],[6,2,6,3],[7,2,7,3],[8,2,8,3],[9,2,9,3],[10,2,10,3],[11,2,11,3],[13,0,13,1],[14,0,14,1],[16,0,16,1],[17,0,17,1],[9,0,9,1],[10,0,10,1],[1,0,1,1],[1,2,1,3],[191,2,191,3],[192,2,192,3],[193,2,193,3],[194,2,194,3],[195,2,195,3],[196,2,196,3],[197,2,197,3],[121,2,121,3],[122,2,122,3],[123,2,123,3],[180,2,180,3],[181,2,181,3],[182,2,182,3],[183,2,183,3],[184,2,184,3],[185,2,185,3],[112,2,112,3],[113,2,113,3],[114,2,114,3],[115,2,115,3],[116,2,116,3],[117,2,117,3],[350,2,350,3],[18,0,18,1],[350,0,350,1],[351,2,351,3],[352,2,352,3],[353,2,353,3],[354,2,354,3],[355,2,355,3],[356,2,356,3],[118,2,118,3],[119,2,119,3],[120,2,120,3],[143,2,143,3],[157,2,157,3],[159,2,159,3],[161,2,161,3],[163,2,163,3],[165,2,165,3],[158,2,158,3],[160,2,160,3],[162,2,162,3],[164,2,164,3],[166,2,166,3],[167,2,167,3],[366,2,366,3],[367,2,367,3],[368,2,368,3],[369,2,369,3],[370,2,370,3],[371,2,371,3],[372,2,372,3],[357,2,357,3],[358,2,358,3],[359,2,359,3],[360,2,360,3],[361,2,361,3],[362,2,362,3],[363,2,363,3],[364,2,364,3],[365,2,365,3],[367,0,367,1],[368,0,368,1],[369,0,369,1],[370,0,370,1],[371,0,371,1],[372,0,372,1],[351,0,351,1],[352,0,352,1],[353,0,353,1],[354,0,354,1],[355,0,355,1],[356,0,356,1],[357,0,357,1],[358,0,358,1],[359,0,359,1],[360,0,360,1],[361,0,361,1],[362,0,362,1],[363,0,363,1],[364,0,364,1],[365,0,365,1],[366,0,366,1]]}
[]
["Annual Recycling Report Summary",null,{"$f":"IF('Report Calculator (Required)'!B5=0,\"\",IF('Report Calculator (Required)'!B5=\"I am a property manager filing for one or more tenant(s) leasing property at a single site. \",_xlfn.CONCAT(\"DUE: 03/01/\",'Report Calculator (Required)'!B3:C3),IF('Report Calculator (Required)'!B12>=250,_xlfn.CONCAT(\"DUE: 02/01/\",'Report Calculator (Required)'!B3:C3),_xlfn.CONCAT(\"DUE: 03/01/\",'Report Calculator (Required)'!B3:C3))))","v":""}]
["Report for year:",null,{"$f":"'Report Calculator (Required)'!B3","v":0}]
["Filer Details"]
[{"$f":"IF('Report Calculator (Required)'!B5=0, \"[Filer]\", 'Report Calculator (Required)'!B5)","v":"[Filer]"}]
[{"$f":"IF('Report Calculator (Required)'!B6=0, \"[Business Name]\", 'Report Calculator (Required)'!B6)","v":"[Business Name]"},null,{"$f":"IF('Report Calculator (Required)'!B7=0, \"[Mailing Address]\", 'Report Calculator (Required)'!B7)","v":"[Mailing Address]"},{"$f":"IF('Report Calculator (Required)'!C7=0, \"[Zip Code]\", 'Report Calculator (Required)'!C7)","v":"[Zip Code]"}]
[{"$f":"IF('Report Calculator (Required)'!B8=0, \"[Phone Number]\", 'Report Calculator (Required)'!B8)","v":"[Phone Number]"},null,{"$f":"IF('Report Calculator (Required)'!B9=0, \"[Contact Person]\", 'Report Calculator (Required)'!B9)","v":"[Contact Person]"}]
[{"$f":"IF('Report Calculator (Required)'!B11=0, \"[Government Agency?]\", 'Report Calculator (Required)'!B11)","v":"[Government Agency?]"},null,{"$f":"IF('Report Calculator (Required)'!B10=0, \"[Contact Person Email]\", 'Report Calculator (Required)'!B10)","v":"[Contact Person Email]"}]
[]
["Principal Program Specialist",null,{"$f":"IF('Report Calculator (Required)'!B11=\"County\",Zips!B60,IF(COUNTIF(Zips!A2:A22,'Report Calculator (Required)'!C7)>0,Zips!B2,IF(COUNTIF(Zips!A23:A32,'Report Calculator (Required)'!C7)>0,Zips!B23,IF(COUNTIF(Zips!A33:A43,'Report Calculator (Required)'!C7)>0,Zips!B33,IF(COUNTIF(Zips!A44:A58,'Report Calculator (Required)'!C7)>0,Zips!B44,\"Unknown Zip Code!\")))))","v":"Unknown Zip Code!"}]
[null,null,{"$f":"IF('Report Calculator (Required)'!B11=\"County\",Zips!C60,IF(COUNTIF(Zips!A2:A22,'Report Calculator (Required)'!C7)>0,Zips!C2,IF(COUNTIF(Zips!A23:A32,'Report Calculator (Required)'!C7)>0,Zips!C23,IF(COUNTIF(Zips!A33:A43,'Report Calculator (Required)'!C7)>0,Zips!C33,IF(COUNTIF(Zips!A44:A58,'Report Calculator (Required)'!C7)>0,Zips!C44,\"Unknown Zip Code!\")))))","v":"Unknown Zip Code!"}]
["Total # Employees",null,{"$f":"'Report Calculator (Required)'!B12","v":0}]
["Total Square Feet of Building",null,{"$f":"'Report Calculator (Required)'!B13","v":0}]
["Total Acerage of Green Area",null,{"$f":"'Report Calculator (Required)'!B14","v":0}]
[]
{"$rows_left_out":359}
{"sheet":"Lists","index":4,"n_rows":47,"n_cols":3,"rows_kept":47,"cut":false,"hidden":true,"merged":[]}
["I am filing for my business only. "]
["I am a property manager filing for one or more tenant(s) leasing property at a single site. "]
["I am filing from the Business Headquarters for multiple businesses in the County. "]
["I am a collector filing for my customer. "]
["I am a Program Specialist filing for the business(es) in my designated area. "]
[]
["County"]
["State"]
["Federal"]
["None of the above"]
[]
["Yes"]
["No"]
[]
["Dual Stream"]
{"$rows_left_out":33}
{"sheet":"Calcs","index":5,"n_rows":319,"n_cols":14,"rows_kept":319,"cut":false,"hidden":true,"merged":[[0,0,0,2]]}
["Calculations"]
["Container Size","Weight","# Containers","# Pickups","Pickup Frequency","Pickup Per Week","Weeks (COVID-Adjusted)","Pickup Duration (Length)","Pickup Duration (Frequency)","Pickup Duration (Weeks)",null,"Total Yearly Pounds"]
["Mixed Paper"]
["90-96 gal Container",93,{"$f":"'Report Calculator (Required)'!B116","v":0},{"$f":"'Report Calculator (Required)'!B117","v":2},{"$f":"'Report Calculator (Required)'!C117","v":"/week"},{"$f":"IF(E4=\"/month\",IMDIV(D4,4.3),IF(E4=\"/week\",D4,IF(E4=\"/year\",IMDIV(D4,52),\"0\")))","v":2},{"$f":"52-'Report Calculator (Required)'!B17","v":52},{"$f":"'Report Calculator (Required)'!B132","v":1},{"$f":"'Report Calculator (Required)'!C132","v":"year"},{"$f":"IF(I4=\"months\",H4*4.3,IF(I4=\"year\",H4*52,IF(I4=\"weeks\",H4,\"0\")))","v":52},null,{"$f":"IF(J4=0,B4*C4*F4*G4,B4*C4*F4*J4)","v":0}]
["90-96 gal Container",93,{"$f":"'Report Calculator (Required)'!B135","v":0},{"$f":"'Report Calculator (Required)'!B136","v":1},{"$f":"'Report Calculator (Required)'!C136","v":"/week"},{"$f":"IF(E5=\"/month\",IMDIV(D5,4.3),IF(E5=\"/week\",D5,IF(E5=\"/year\",IMDIV(D5,52),\"0\")))","v":1},{"$f":"52-'Report Calculator (Required)'!B17","v":52},{"$f":"'Report Calculator (Required)'!B151","v":22},{"$f":"'Report Calculator (Required)'!C151","v":"weeks"},22,null,{"$f":"IF(J5=0,B5*C5*F5*G5,B5*C5*F5*J5)","v":0}]
["90-96 gal Container",93,{"$f":"'Report Calculator (Required)'!B154","v":0},{"$f":"'Report Calculator (Required)'!B155","v":0},{"$f":"'Report Calculator (Required)'!C155","v":0},"0",{"$f":"52-'Report Calculator (Required)'!B17","v":52},{"$f":"'Report Calculator (Required)'!B170","v":0},{"$f":"'Report Calculator (Required)'!C170","v":0},"0",null,0]
["90-96 gal Container",93,{"$f":"'Report Calculator (Required)'!B173","v":0},{"$f":"'Report Calculator (Required)'!B174","v":0},{"$f":"'Report Calculator (Required)'!C174","v":0},"0",{"$f":"52-'Report Calculator (Required)'!B17","v":52},{"$f":"'Report Calculator (Required)'!B189","v":0},{"$f":"'Report Calculator (Required)'!C189","v":0},"0",null,0]
["90-96 gal Container",93,{"$f":"'Report Calculator (Required)'!B192","v":0},{"$f":"'Report Calculator (Required)'!B193","v":0},{"$f":"'Report Calculator (Required)'!C193","v":0},"0",{"$f":"52-'Report Calculator (Required)'!B17","v":52},{"$f":"'Report Calculator (Required)'!B208","v":0},{"$f":"'Report Calculator (Required)'!C208","v":0},"0",null,0]
["2-Cubic Yard Dumpster",127,{"$f":"'Report Calculator (Required)'!B118","v":0},{"$f":"'Report Calculator (Required)'!B119","v":0},{"$f":"'Report Calculator (Required)'!C119","v":0},"0",{"$f":"52-'Report Calculator (Required)'!B17","v":52},{"$f":"'Report Calculator (Required)'!B132","v":1},{"$f":"'Report Calculator (Required)'!C132","v":"year"},52,null,0]
["2-Cubic Yard Dumpster",127,{"$f":"'Report Calculator (Required)'!B137","v":0},{"$f":"'Report Calculator (Required)'!B138","v":0},{"$f":"'Report Calculator (Required)'!C138","v":0},"0",{"$f":"52-'Report Calculator (Required)'!B17","v":52},{"$f":"'Report Calculator (Required)'!B151","v":22},{"$f":"'Report Calculator (Required)'!C151","v":"weeks"},22,null,0]
["2-Cubic Yard Dumpster",127,{"$f":"'Report Calculator (Required)'!B156","v":0},{"$f":"'Report Calculator (Required)'!B157","v":0},{"$f":"'Report Calculator (Required)'!C157","v":0},"0",{"$f":"52-'Report Calculator (Required)'!B17","v":52},{"$f":"'Report Calculator (Required)'!B170","v":0},{"$f":"'Report Calculator (Required)'!C170","v":0},"0",null,0]
["2-Cubic Yard Dumpster",127,{"$f":"'Report Calculator (Required)'!B175","v":0},{"$f":"'Report Calculator (Required)'!B176","v":0},{"$f":"'Report Calculator (Required)'!C176","v":0},"0",{"$f":"52-'Report Calculator (Required)'!B17","v":52},{"$f":"'Report Calculator (Required)'!B189","v":0},{"$f":"'Report Calculator (Required)'!C189","v":0},"0",null,0]
["2-Cubic Yard Dumpster",127,{"$f":"'Report Calculator (Required)'!B194","v":0},{"$f":"'Report Calculator (Required)'!B195","v":0},{"$f":"'Report Calculator (Required)'!C195","v":0},"0",{"$f":"52-'Report Calculator (Required)'!B17","v":52},{"$f":"'Report Calculator (Required)'!B208","v":0},{"$f":"'Report Calculator (Required)'!C208","v":0},"0",null,0]
["4-Cubic Yard Dumpster",254,{"$f":"'Report Calculator (Required)'!B120","v":0},{"$f":"'Report Calculator (Required)'!B121","v":0},{"$f":"'Report Calculator (Required)'!C121","v":0},"0",{"$f":"52-'Report Calculator (Required)'!B17","v":52},{"$f":"'Report Calculator (Required)'!B132","v":1},{"$f":"'Report Calculator (Required)'!C132","v":"year"},52,null,0]
["4-Cubic Yard Dumpster",254,{"$f":"'Report Calculator (Required)'!B139","v":0},{"$f":"'Report Calculator (Required)'!B140","v":0},{"$f":"'Report Calculator (Required)'!C140","v":0},"0",{"$f":"52-'Report Calculator (Required)'!B17","v":52},{"$f":"'Report Calculator (Required)'!B151","v":22},{"$f":"'Report Calculator (Required)'!C151","v":"weeks"},22,null,0]
{"$rows_left_out":305}
{"sheet":"Zips","index":6,"n_rows":60,"n_cols":3,"rows_kept":60,"cut":false,"hidden":true,"merged":[]}
["Zip Code","Program Specialist","Email"]
[21770,"LaToia Walker-James","LaToia.Walker-James@montgomerycountymd.gov"]
[21771,"LaToia Walker-James","LaToia.Walker-James@montgomerycountymd.gov"]
[20872,"LaToia Walker-James","LaToia.Walker-James@montgomerycountymd.gov"]
[21797,"LaToia Walker-James","LaToia.Walker-James@montgomerycountymd.gov"]
[20871,"LaToia Walker-James","LaToia.Walker-James@montgomerycountymd.gov"]
[20881,"LaToia Walker-James","LaToia.Walker-James@montgomerycountymd.gov"]
[20876,"LaToia Walker-James","LaToia.Walker-James@montgomerycountymd.gov"]
[20886,"LaToia Walker-James","LaToia.Walker-James@montgomerycountymd.gov"]
[20833,"LaToia Walker-James","LaToia.Walker-James@montgomerycountymd.gov"]
[20879,"LaToia Walker-James","LaToia.Walker-James@montgomerycountymd.gov"]
[20877,"LaToia Walker-James","LaToia.Walker-James@montgomerycountymd.gov"]
[20880,"LaToia Walker-James","LaToia.Walker-James@montgomerycountymd.gov"]
[20855,"LaToia Walker-James","LaToia.Walker-James@montgomerycountymd.gov"]
[20862,"LaToia Walker-James","LaToia.Walker-James@montgomerycountymd.gov"]
{"$rows_left_out":45}